{"text_format":"1","workbook":"xlsx","n_sheets":7,"sheets":["0. Instructions","1. Water Report Input","2. Sparge Acidification","3. Grain Bill Input","4. Water Adjustment","5. Adjustment Summary","Water Knowledge"],"not_rendered":{"charts":0,"images":5,"macros":1,"external_links":0,"defined_names":35,"comments":5,"pivot_tables":0},"unopened":[],"bounds":{"document_bytes":16777216,"sheet_cells":100000,"rows_first":2000,"rows_last":500,"rows_between":2000,"halvings":0,"cell_chars":16384,"cell_head_chars":4096},"cells_cut":0,"cells_raw":0,"read":"whole","date_system":"1900"}

{"sheet":"0. Instructions","index":0,"n_rows":161,"n_cols":11,"rows_kept":161,"cut":false,"hidden":false,"merged":[[108,0,108,10],[15,1,15,10],[21,0,21,10],[98,0,98,10],[2,0,2,10],[101,0,101,10],[100,0,100,10],[74,0,74,10],[66,0,66,10],[16,1,16,10],[17,1,17,10],[18,1,18,10],[14,1,14,10],[13,0,13,10],[104,0,104,10],[106,0,106,10],[107,0,107,10],[105,0,105,10],[28,0,28,10],[29,0,29,10],[92,0,92,10],[93,0,93,10],[94,0,94,10],[1,0,1,10],[6,0,6,10],[26,0,26,10],[24,0,24,10],[11,0,11,10],[4,0,4,10],[3,0,3,10],[7,0,7,10],[23,0,23,10],[22,0,22,10],[9,0,9,10],[10,0,10,10],[5,0,5,10],[12,0,12,10],[20,1,20,10],[75,0,75,10],[64,0,64,10],[68,0,68,10],[67,0,67,10],[69,0,69,10],[36,0,36,10],[50,0,50,10],[160,0,160,1],[159,0,159,10],[158,0,158,10],[153,0,153,10],[152,0,152,10],[146,0,146,10],[151,0,151,10],[157,0,157,10],[156,0,156,10],[155,0,155,10],[154,0,154,10],[148,0,148,10],[35,0,35,10],[25,0,25,10],[27,0,27,10],[138,0,138,10],[150,0,150,10],[147,0,147,10],[144,0,144,10],[143,0,143,10],[141,0,141,10],[149,0,149,10],[140,0,140,10],[137,0,137,10],[139,0,139,10],[136,0,136,10],[142,0,142,10],[145,0,145,10],[95,0,95,10],[51,0,51,10],[60,0,60,10],[62,0,62,10],[57,0,57,10],[97,0,97,10],[65,0,65,10],[58,0,58,10],[0,0,0,1],[0,2,0,10],[8,0,8,10],[43,0,43,10],[52,0,52,10],[55,0,55,10],[53,0,53,10],[31,0,31,10],[42,0,42,10],[54,0,54,10],[47,0,47,10],[49,0,49,10],[46,0,46,10],[38,0,38,10],[45,0,45,10],[40,0,40,10],[48,0,48,10],[30,0,30,10],[34,0,34,10],[32,0,32,10],[37,0,37,10],[19,1,19,10],[39,0,39,10],[33,0,33,10],[135,0,135,10],[134,0,134,10],[76,0,76,10],[77,0,77,10],[78,0,78,10],[79,0,79,10],[80,0,80,10],[111,0,111,10],[96,0,96,10],[132,0,132,10],[131,0,131,10],[133,0,133,10],[99,0,99,10],[110,0,110,10],[116,0,116,10],[122,0,122,10],[109,0,109,10],[102,0,102,10],[103,0,103,10],[112,0,112,10],[84,0,84,10],[85,0,85,10],[127,0,127,10],[130,0,130,10],[41,0,41,10],[59,0,59,10],[72,0,72,10],[71,0,71,10],[73,0,73,10],[70,0,70,10],[56,0,56,10],[61,0,61,10],[63,0,63,10],[44,0,44,10],[87,0,87,10],[88,0,88,10],[89,0,89,10],[90,0,90,10],[91,0,91,10],[81,0,81,10],[82,0,82,10],[83,0,83,10],[86,0,86,10],[124,0,124,10],[129,0,129,10],[123,0,123,10],[113,0,113,10],[128,0,128,10],[117,0,117,10],[118,0,118,10],[126,0,126,10],[120,0,120,10],[115,0,115,10],[125,0,125,10],[121,0,121,10],[119,0,119,10],[114,0,114,10]]}
["Bru'n Water",null,"Copyright © 2016 Martin Brungard. All rights reserved. Reproduction in whole or in part in any form or medium without the express written permission of Martin Brungard, is prohibited. Bru'n Water is not Freeware or Shareware and it is illegal to distribute or transfer this program in any form except by Martin Brungard."]
["Instructions"]
["Created by Martin Brungard, P.E. D.WRE  (mabrungard@hotmail.com)"]
["            Most water sources that have an acceptable taste can be used to brew beer.  But to brew great beer across a wide variety of styles, adjustment of brewing water is probably needed.   Bru'n Water is a brewing water analysis program that enables a brewer to successfully evaluate and modify their water supply to improve their beer.  The program steps through the evaluation of a brewer's water supply, adjustment to a desired water profile, evaluation of potential mash pH, and adjustments to produce desirable mash pH. "]
["Homebrewing and Craftbrewing are unique in their need to frequently assess and adjust their brewing water to better suit their upcoming beer.  This differs from the needs of production breweries that brew thousands of barrels of the same beer every year.  Consistency is the key for production brewers and they have little need to evaluate or change their brewing water.  Through trial and error and advanced laboratory analyses, production breweries typically know exactly what adjustments they need for their brewing water.  Homebrewers and Craftbrewers rarely have the tools at their disposal to perfect their water and since they often change what beer they brew, a capable tool is helpful.  This brewing tool is intended to aid those who want to get great results out of every batch."]
["Getting Started"]
["            The first thing needed for brewing water analysis is to know your water supply characteristics and ion concentrations.  Of course, you want a water supply that is safe to drink and tastes good.  Water that leaves black, brown, or red water staining may be an indication that the water will need additional treatment to be suitable for brewing.  Water that has been softened by typical salt-based water softeners (ion exchange) is not typically desirable for brewing due to several factors including:  elevated sodium or potassium content, low calcium and magnesium content, while still containing excessive alkalinity.   Brewers with softened water may find that obtaining their brewing water from a point upstream of their softener unit will produce better brewing results.  An exception is if the raw water has iron or manganese at perceptible levels.  Hard water is not typically an obstacle to brewing good beer.  However, alkalinity is a problem typical to many brewers.  Ion-exchange water softeners do not affect alkalinity significantly and the resulting water is often poorly suited to brewing."]
["A comprehensive instruction on brewing water knowledge is included in this program to assist the brewer in understanding brewing water chemistry.  Select the Water Knowledge tab to view.  A link to the on-line version of the Water Knowledge is provided below.  The on-line version is more up to date and should be the preferred resource."]
{"$rows_left_out":154}
{"sheet":"1. Water Report Input","index":1,"n_rows":40,"n_cols":10,"rows_kept":40,"cut":false,"hidden":false,"merged":[[3,0,3,1],[3,2,3,3],[4,1,4,2],[0,1,0,3],[17,0,17,3],[9,0,9,1],[21,0,21,3],[36,0,36,3],[13,0,13,3],[12,0,12,3],[16,0,16,3],[14,2,14,4],[15,0,15,3]]}
["Bru'n Water","Link to Bru'n Water website for updates and to donate"]
["Enter data into Light Blue cells, Yellow cells display calculated results, Pink cells contain selection boxes"]
["Program Volume Setting","Gallons","< Select",null,null,null,null,1,"Gallons"]
["Water Report Input ",null,"Hover cursor over cells w/ red corner marks to display information",null,null,null,null,2,"Liters"]
["Cations","Enter Ion Concentrations from Water Report     (mg/L or ppm)",null,"Anions"]
["Calcium (Ca)",30.97,108.8,"Bicarbonate (HCO3)"]
["Magnesium (Mg)",7.88,0.5,"Carbonate (CO3)",null,null,null,{"$f":"INDEX(H3:H6, MATCH(B3, I3:I6,0))","v":1}]
["Sodium (Na)",14.57,24.15,"Sulfate (SO4)","multiply lab result by 3 if lab reports as SO4-S"]
{"$rows_left_out":33}
{"sheet":"2. Sparge Acidification","index":2,"n_rows":63,"n_cols":21,"rows_kept":63,"cut":false,"hidden":false,"merged":[[0,1,0,4],[17,0,17,3],[9,0,9,3],[2,0,2,3],[1,0,1,3],[3,2,3,3],[4,2,4,3],[5,2,5,3],[15,0,15,3],[16,0,16,3]]}
["Bru'n Water","Link to Bru'n Water website for updates and to donate"]
["Sparging Water Acidification Calculator"]
["INPUTS"]
["Starting Water Alkalinity =",{"$f":"'1. Water Report Input'!$B$15","v":90.013661202185787},"ppm as CaCO3"]
["Starting Water pH =",8,"Standard Units"]
["Set the Target Water pH =",5.5,"Standard Units"]
["Water Volume to Treat=",1,{"$f":"I57","v":"Gallons"},"Input 1.0 for the volume to have the program automatically calculate acid additions for the sparging volume input on the Water Adjustment sheet."]
["Acid Type =","Lactic","Acid type used in sparging water"]
{"$rows_left_out":56}
{"sheet":"3. Grain Bill Input","index":3,"n_rows":35,"n_cols":24,"rows_kept":35,"cut":false,"hidden":false,"merged":[[28,0,28,5],[29,0,29,5],[22,0,22,5],[0,1,0,5],[25,2,25,5],[26,2,26,5],[25,1,27,1],[2,0,2,1],[2,2,2,5],[27,2,27,5],[19,2,19,4],[20,2,20,4],[3,0,3,5]]}
["Bru'n Water","Link to Bru'n Water website for updates and to donate"]
[null,null,null,null,null,null,null,null,null,null,null,null,null,null,null,1,"Base Malt"]
["Grain Bill Input ",null," Hover cursor over cells w/ red corner marks to display helpful information",null,null,null,null,null,null,null,null,null,null,null,null,2,"Crystal Malt"]
["Enter data into Light Blue cells, Yellow cells display calculated results, Pink cells contain selection boxes",null,null,null,null,null,null,null,null,null,null,null,null,null,null,3,"Roast Malt"]
["Grains","Grain Type",{"$f":"O35","v":"Quantity (lb)"},{"$f":"P35","v":"Quantity (oz)"},{"$f":"IF(B20=\"Lovibond\",R28,R29)","v":"Color (L)"},"Percentage of         Grain Bill",null,null,null,null,1,2,3,4,null,4,"Acid Malt"]
["2 Row Pale Malt","Base Malt",19.850000000000001,0,1.75,{"$f":"100*(N(C6)+(N(D6)/$V$35))/$C$18","v":81.855670103092777},null,{"$f":"((N(C6)+(N(D6)/$V$35))*$U$35*IF(B$20=\"Lovibond\",N(E6),(0.375*N(E6))+0.561))/('4. Water Adjustment'!$V$17*$X$35)","v":2.8947916666666669},{"$f":"HLOOKUP(N(J6),aciditytable,2,FALSE)","v":0.25697490092470282},{"$f":"INDEX($P$2:$P$5, MATCH(B6,$Q$2:$Q$5,0))","v":1},{"$f":"(N(C6)+(N(D6)/$V$35))*$U$35*((0.28*R6))/($N$35*'4. Water Adjustment'!$T$17)","v":0.25697490092470282},{"$f":"(N(C6)+(N(D6)/$V$35))*$U$35*((0.21*R6)+2.5)/($N$35*'4. Water Adjustment'!$T$17)","v":1.5038276089828271},{"$f":"((N(C6)+(N(D6)/$V$35))*$U$35*38)/($N$35*'4. Water Adjustment'!$T$17)","v":19.92866578599736},{"$f":"((N(C6)+(N(D6)/$V$35))*$U$35*1*95)/($N$35*'4. Water Adjustment'!$T$17)","v":49.821664464993397},{"$f":"IF($J6=1,$I6,0)","v":0.25697490092470282},{"$f":"IF($J6=2,$I6,0)","v":0},{"$f":"IF($J6=3,$I6,0)","v":0},{"$f":"IF($B$20=\"lovibond\",N(E6),(0.375*N(E6))+0.561)","v":1.75}]
["Victory","Base Malt",2.2000000000000002,0,28,9.072164948453608,null,{"$f":"((N(C7)+(N(D7)/$V$35))*$U$35*IF(B$20=\"lovibond\",N(E7),(0.375*N(E7))+0.561))/('4. Water Adjustment'!$V$17*$X$35)","v":5.1333333333333337},{"$f":"HLOOKUP(J7,aciditytable,3,FALSE)","v":0.45569352708058136},{"$f":"INDEX($P$2:$P$5, MATCH(B7,$Q$2:$Q$5,0))","v":1},{"$f":"(N(C7)+(N(D7)/$V$35))*$U$35*((0.28*R7))/($N$35*'4. Water Adjustment'!$T$17)","v":0.45569352708058136},{"$f":"(N(C7)+(N(D7)/$V$35))*$U$35*((0.21*R7)+2.5)/($N$35*'4. Water Adjustment'!$T$17)","v":0.48708058124174369},{"$f":"((N(C7)+(N(D7)/$V$35))*$U$35*38)/($N$35*'4. Water Adjustment'!$T$17)","v":2.2087186261558784},{"$f":"((N(C7)+(N(D7)/$V$35))*$U$35*1*95)/($N$35*'4. Water Adjustment'!$T$17)","v":5.521796565389697},{"$f":"IF($J7=1,$I7,0)","v":0.45569352708058136},{"$f":"IF($J7=2,$I7,0)","v":0},{"$f":"IF($J7=3,$I7,0)","v":0},28]
["Crystal 40L","Crystal Malt",1.1000000000000001,0,40,4.536082474226804,null,{"$f":"((N(C8)+(N(D8)/$V$35))*$U$35*IF(B$20=\"lovibond\",N(E8),(0.375*N(E8))+0.561))/('4. Water Adjustment'!$V$17*$X$35)","v":3.6666666666666665},{"$f":"HLOOKUP(J8,aciditytable,4,FALSE)","v":0.31677675033025104},2,{"$f":"(N(C8)+(N(D8)/$V$35))*$U$35*((0.28*R8))/($N$35*'4. Water Adjustment'!$T$17)","v":0.32549537648612947},{"$f":"(N(C8)+(N(D8)/$V$35))*$U$35*((0.21*R8)+2.5)/($N$35*'4. Water Adjustment'!$T$17)","v":0.31677675033025104},{"$f":"((N(C8)+(N(D8)/$V$35))*$U$35*38)/($N$35*'4. Water Adjustment'!$T$17)","v":1.1043593130779392},{"$f":"((N(C8)+(N(D8)/$V$35))*$U$35*1*95)/($N$35*'4. Water Adjustment'!$T$17)","v":2.7608982826948485},0,0.31677675033025104,0,40]
{"$rows_left_out":28}
{"sheet":"4. Water Adjustment","index":4,"n_rows":109,"n_cols":36,"rows_kept":109,"cut":false,"hidden":false,"merged":[[0,0,0,1],[23,8,23,9],[14,8,14,11],[21,8,21,9],[20,10,20,11],[20,8,20,9],[6,0,6,1],[0,2,0,10],[3,8,3,10],[2,0,2,4],[2,5,2,12],[26,2,26,4],[26,10,26,11],[29,9,29,11],[11,0,11,1],[24,8,24,9],[18,10,18,11],[25,8,25,9],[25,10,25,11],[15,2,15,7],[3,0,3,1],[30,8,30,9],[27,7,27,10],[26,8,26,9],[14,15,15,15],[5,0,5,1],[28,8,28,9],[5,8,5,10],[6,8,6,10],[7,8,7,10],[23,10,23,11],[41,14,41,18],[32,13,32,15],[30,10,30,11],[15,8,15,9],[8,14,9,15],[10,15,11,15],[10,14,11,14],[10,0,10,1],[9,0,9,1],[12,0,12,1],[21,10,21,11],[15,10,15,11],[27,2,27,6],[22,8,22,9],[24,10,24,11],[22,10,22,11],[29,2,29,8],[33,0,33,11],[32,0,32,11],[50,14,50,18],[51,14,51,18],[52,14,52,18],[53,14,53,18],[54,14,54,18],[55,14,55,18],[44,14,44,18],[45,14,45,18],[46,14,46,18],[47,14,47,18],[48,14,48,18],[49,14,49,18],[42,14,42,18],[43,14,43,18],[36,14,36,18],[37,14,37,18],[38,14,38,18],[35,0,35,11],[34,0,34,11],[39,14,39,18],[34,13,34,15],[40,14,40,18],[62,14,62,18],[63,14,63,18],[64,14,64,18],[65,14,65,18],[66,14,66,18],[67,14,67,18],[56,14,56,18],[57,14,57,18],[58,14,58,18],[59,14,59,18],[60,14,60,18],[61,14,61,18],[85,14,85,18],[86,14,86,18],[93,14,93,18],[87,14,87,18],[108,14,108,18],[4,0,4,1],[7,0,7,1],[14,12,15,13],[17,8,17,9],[19,10,19,11],[19,8,19,9],[17,10,17,11],[14,14,15,14],[18,8,18,9],[28,10,28,11],[84,14,84,18],[68,14,68,18],[69,14,69,18],[74,14,74,18],[75,14,75,18],[80,14,80,18],[70,14,70,18],[76,14,76,18],[4,8,4,10],[71,14,71,18],[72,14,72,18],[73,14,73,18],[107,14,107,18],[77,14,77,18],[94,14,94,18],[95,14,95,18],[102,14,102,18],[96,14,96,18],[97,14,97,18],[98,14,98,18],[99,14,99,18],[100,14,100,18],[101,14,101,18],[78,14,78,18],[79,14,79,18],[88,14,88,18],[89,14,89,18],[90,14,90,18],[91,14,91,18],[92,14,92,18],[81,14,81,18],[82,14,82,18],[83,14,83,18]]}
["Bru'n Water",null,"Link to Bru'n Water website for updates and to donate"]
["Enter data into Light Blue cells, Yellow cells display calculated results, Pink cells contain selection boxes"]
["Water Profile Adjustment Calculator                           ",null,null,null,null,"Hover cursor over cells w/ red corner marks to display helpful information",null,null,null,null,null,null,null,null,null,null,null,null,null,null,null,"hco3","so4","cl"]
["Desired Water Profile",null,"Calcium      (ppm)","Magnesium (ppm)","Sodium        (ppm)","Sulfate        (ppm)","Chloride      (ppm)","Bicarbonate (ppm)","Approximate Color Descriptors for Water Profiles",null,null,null,null,null,null,null,null,null,null,1,"%",{"$f":"IF(AF11=9,(N(B29)/V14)*(-182.85/0.8254),-(((N(B29)/V14)*(D29/100)*(((VLOOKUP(AF11,acidtable,7,FALSE))*V49*61)/(VLOOKUP(AF11,acidtable,6,FALSE))))))","v":-147.75812745653121},{"$f":"IF(AF11=9,(B29/V14)*(88.57),-V4*96/122)","v":116.26869045759832},{"$f":"IF(AF11=9,(B29/V14)*(64),-V4*35.5/61)","v":85.990385650932097}]
["Yellow Dry",null,{"$f":"VLOOKUP($AF$10,profiles,3,FALSE)","v":50},{"$f":"VLOOKUP($AF$10,profiles,4,FALSE)","v":10},{"$f":"VLOOKUP($AF$10,profiles,5,FALSE)","v":5},{"$f":"VLOOKUP($AF$10,profiles,6,FALSE)","v":105},{"$f":"VLOOKUP($AF$10,profiles,7,FALSE)","v":45},{"$f":"VLOOKUP($AF$10,profiles,8,FALSE)","v":0},"Yellow: under 6 SRM",null,null,null,null,null,null,null,null,null,null,2,"N",{"$f":"IF(AF11=9,(N(B29)/V14)*(-182.85/0.8254),-(N(B29)/V14)*N(D29)*61)","v":-1134.5838837516512},{"$f":"IF(AF11=9,(N(B29)/V14)*(88.57),-V5*96/122)","v":892.78731836195504},{"$f":"IF(AF11=9,(N(B29)/V14)*(64),-V5*35.5/61)","v":660.29062087186264}]
["Existing Water Profile",null,{"$f":"'1. Water Report Input'!$B$6","v":30.97},{"$f":"'1. Water Report Input'!$B$7","v":7.88},{"$f":"'1. Water Report Input'!$B$8","v":14.57},{"$f":"'1. Water Report Input'!$C$8","v":24.15},{"$f":"'1. Water Report Input'!$C$9","v":27},{"$f":"'1. Water Report Input'!$B$15*61/50","v":109.81666666666666},"Amber: 7 to 17 SRM",null,null,null,null,null,null,null,null,null,null,3,"M",{"$f":"IF(AF11=9,(N(B29)/V14)*(-182.85/0.8254),-(N(B29)/V14)*N(D29)*V49*61)","v":-1102.779379049872},{"$f":"IF(AF11=9,(N(B29)/V14)*(88.57),-V6*96/122)","v":867.76082285891573},{"$f":"IF(AF11=9,(N(B29)/V14)*(64),-V6*35.5/61)","v":641.78144190607304},null,null,null,{"$f":"IF(AND($AF$11>=6,$AF$11<=8),\"(gram/gal)\",\"(mL/gal)\")","v":"(mL/gal)"}]
["Dilution Water Profile",null,null,null,null,null,null,null,"Brown: 18 to 30 SRM",null,null,null,null,null,null,null,null,null,null,4,"Solid",{"$f":"IF(AF11=9,(N(B29)/V14)*(-182.85/0.8254),-((N(B29)*1000/V14)*61*V49)/Y35)","v":-139.11616177663691},{"$f":"IF(AF11=9,(N(B29)/V14)*(88.57),0)","v":0},{"$f":"IF(AF11=9,(N(B29)/V14)*(64),0)","v":0},null,null,null,{"$f":"IF(AND($AF$11>=6,$AF$11<=8),\"(gram/L)\",\"(mL/L)\")","v":"(mL/L)"}]
["RO Water",null,{"$f":"VLOOKUP($AG$10,dilution,3,FALSE)","v":1},{"$f":"VLOOKUP($AG$10,dilution,4,FALSE)","v":0},{"$f":"VLOOKUP($AG$10,dilution,5,FALSE)","v":8},{"$f":"VLOOKUP($AG$10,dilution,6,FALSE)","v":1},{"$f":"VLOOKUP($AG$10,dilution,7,FALSE)","v":4},{"$f":"VLOOKUP($AG$10,dilution,8,FALSE)","v":16},"Black: over 31 SRM",null,null,null,null,null,null,null,null,null,null,null,{"$f":"VLOOKUP($AF$12,strengthtable,2,FALSE)","v":"%"},{"$f":"((H6*(50/61)*(1+(2*10^-2.33)))-(($C$6*0.7143)+($D$6*0.5879)))","v":64.101189252989428}]
{"$rows_left_out":102}
{"sheet":"5. Adjustment Summary","index":5,"n_rows":31,"n_cols":18,"rows_kept":31,"cut":false,"hidden":false,"merged":[[28,0,28,8],[16,0,16,2],[14,3,14,5],[23,0,23,2],[25,6,25,8],[24,0,24,2],[24,6,24,8],[24,3,24,5],[17,6,17,8],[23,3,23,5],[9,0,9,1],[12,0,14,2],[22,3,22,5],[22,6,22,8],[23,6,23,8],[10,3,10,4],[15,3,15,5],[12,3,12,4],[13,6,13,7],[14,6,14,8],[12,6,12,7],[19,6,19,8],[18,6,18,8],[19,3,19,5],[17,0,17,1],[17,3,17,5],[0,3,0,8],[0,0,0,2],[1,0,1,1],[1,2,1,8],[2,0,2,3],[2,4,2,8],[10,0,10,1],[13,3,13,4],[4,0,4,2],[19,0,19,2],[5,0,5,2],[8,0,8,2],[9,6,9,7],[6,0,6,2],[26,3,26,5],[10,6,10,7],[16,3,16,5],[18,3,18,5],[9,3,9,4],[15,0,15,2],[18,0,18,2],[21,6,21,8],[21,3,21,5],[20,0,20,2],[21,0,21,2],[22,0,22,2],[15,6,15,8],[16,6,16,8]]}
["Bru'n Water ",null,null,"Link to Bru'n Water website for updates and to donate"]
[]
["Water Adjustment Summary",null,null,null," Hover cursor over cells w/ red corner marks to display helpful information"]
[{"$f":"'4. Water Adjustment'!$A$5","v":"Yellow Dry"},null,null,"Calcium (ppm)","Magnesium (ppm)","Sodium (ppm)","Sulfate (ppm)","Chloride (ppm)","Bicarbonate (ppm)"]
["Existing Water Profile",null,null,{"$f":"'4. Water Adjustment'!C6","v":30.97},{"$f":"'4. Water Adjustment'!D6","v":7.88},{"$f":"'4. Water Adjustment'!E6","v":14.57},{"$f":"'4. Water Adjustment'!F6","v":24.15},{"$f":"'4. Water Adjustment'!G6","v":27},{"$f":"'4. Water Adjustment'!H6","v":109.81666666666666}]
["Mashing Water Profile",null,null,{"$f":"'4. Water Adjustment'!C13","v":30.97},{"$f":"'4. Water Adjustment'!D13","v":7.88},{"$f":"'4. Water Adjustment'!E13","v":14.57},{"$f":"'4. Water Adjustment'!F13","v":24.15},{"$f":"'4. Water Adjustment'!G13","v":27},{"$f":"'4. Water Adjustment'!H13","v":-37.94146078986455}]
["Recommended Ranges",null,null,"40 to 150","0 to 30","0 to 150","0 to 350","0 to 100","as needed"]
[]
{"$rows_left_out":24}
{"sheet":"Water Knowledge","index":6,"n_rows":148,"n_cols":11,"rows_kept":148,"cut":false,"hidden":false,"merged":[[144,0,144,10],[145,0,145,10],[147,0,147,10],[138,0,138,10],[139,0,139,10],[140,0,140,10],[141,0,141,10],[142,0,142,10],[143,0,143,10],[125,9,125,10],[133,0,133,10],[134,0,134,10],[135,0,135,10],[136,0,136,10],[137,0,137,10],[119,0,119,10],[120,0,120,10],[121,0,121,10],[122,0,122,10],[123,0,123,10],[124,2,124,7],[124,9,124,10],[113,0,113,10],[114,0,114,10],[115,0,115,10],[116,0,116,10],[117,0,117,10],[118,0,118,10],[107,0,107,10],[108,0,108,10],[109,0,109,10],[110,0,110,10],[111,0,111,10],[112,0,112,10],[101,0,101,10],[102,0,102,10],[103,0,103,10],[104,0,104,10],[105,0,105,10],[106,0,106,10],[95,0,95,10],[96,0,96,10],[97,0,97,10],[98,0,98,10],[99,0,99,10],[100,0,100,10],[89,0,89,10],[90,0,90,10],[91,0,91,10],[92,0,92,10],[93,0,93,10],[94,0,94,10],[83,0,83,10],[84,0,84,10],[85,0,85,10],[86,0,86,10],[87,0,87,10],[88,0,88,10],[77,0,77,10],[78,0,78,10],[79,0,79,10],[80,0,80,10],[81,0,81,10],[82,0,82,10],[71,0,71,10],[72,0,72,10],[73,0,73,10],[74,0,74,10],[75,0,75,10],[76,0,76,10],[65,9,65,10],[66,9,66,10],[67,0,67,10],[68,0,68,10],[69,0,69,10],[70,0,70,10],[59,9,59,10],[60,9,60,10],[61,9,61,10],[62,9,62,10],[63,9,63,10],[64,9,64,10],[54,0,54,10],[55,0,55,10],[56,0,56,10],[57,2,57,7],[57,9,57,10],[58,9,58,10],[48,0,48,10],[49,0,49,10],[50,0,50,10],[51,0,51,10],[52,0,52,10],[53,0,53,10],[42,0,42,10],[43,0,43,10],[44,0,44,10],[45,0,45,10],[46,0,46,10],[47,0,47,10],[36,0,36,10],[37,0,37,10],[38,0,38,10],[39,0,39,10],[40,0,40,10],[41,0,41,10],[30,0,30,10],[31,0,31,10],[32,0,32,10],[33,0,33,10],[34,0,34,10],[35,0,35,10],[24,0,24,10],[25,0,25,10],[26,0,26,10],[27,0,27,10],[28,0,28,10],[29,0,29,10],[18,0,18,10],[19,0,19,10],[20,0,20,10],[21,0,21,10],[22,0,22,10],[23,0,23,10],[12,0,12,10],[13,0,13,10],[14,0,14,10],[15,0,15,10],[16,0,16,10],[17,0,17,10],[6,0,6,10],[7,0,7,10],[8,0,8,10],[9,0,9,10],[10,0,10,10],[11,0,11,10],[0,0,0,2],[0,5,0,10],[1,0,1,4],[3,0,3,10],[4,0,4,10],[5,0,5,10]]}
["Bru'n Water"]
["Link to the On-Line Version of Water Knowledge"]
["Water Knowledge",null,null,null,null,null,null,null,null,null,"by Martin Brungard"]
["This section provides the user with basic knowledge that is useful for understanding brewing water chemistry.  Water is the most basic building block in brewing.  Beer can contain up to 97 percent water, so it’s by far the largest component in beer.  A variety of ions and chemicals can be dissolved in water.  Water is seemingly simple, yet its ionic components can drastically affect a finished beer’s quality and perception.  Those effects may range from dramatic to barely perceptible.  The following sections discuss how water affects the brewing process and the quality and perception of beer.   "]
["Water Sources "]
["Many brewers rely on municipal water supplies for their water.  Other brewers may have private wells, springs, rain barrels, or other local sources for their brewing water. The source of water can have a substantial effect on its quality and variability. "]
["Municipal sources in the U.S. typically treat and verify that their water is safe to drink. Municipal water companies typically rely on surface water sources (rivers, lakes, and reservoirs) and/or groundwater sources (springs and wells) for their water source. A variety of processes can affect the quantity and quality of water from these sources through the year.  For instance, large volumes of snow melt or rainfall can provide softer water to a surface water source while that surface water can become more mineralized from groundwater inflow at other times of the year.  Differing ionic content of brewing water can affect mashing performance and flavor perceptions. "]
["Ions in water come primarily from the soil and rock minerals that the water contacts as it flows through the environment. In areas where the soil and rock are less soluble, the degree of mineralization of the water may be lower. But when the soil and rock are more soluble, the water may dissolve significant concentrations of ions.  The effect of these dissolved ions is presented in the following sections. "]
{"$rows_left_out":140}